Part of Curriculum: Protocol RTL Design (Module 8: AXI Read Channel Burst Controller)
View Full Roadmap →
Level 6 Industry Challenge ★ Advanced #47 50 pts ✓ Solved

Burst-Aware AXI4 Read Transaction Controller

Advanced RTL & Protocol Design · advanced-rtl, axi-protocol, systemverilog, asic, fpga

Implement an AXI4 read master controller handling address issue, multi-beat read streaming, RLAST tracking, and backpressure.

Write a synthesizable Verilog module named top_module matching the ports below exactly.
📐 Circuit Schematic Diagram
start_readrd_addr[31:0]ARVALIDRVALIDread_doneread_data_out[31:0]>clkrst_nBURST-AWARE AXI4 REAPROTOCOL INTERFACE
⚡ Timing & Synthesizability Constraints

Timing Contract: Clocked on posedge ACLK, active-low ARESETn. ARADDR must remain stable while ARVALID=1. RREADY backpressure must be respected without data loss.

RTL Constraints: Synthesizable Verilog-2001. Track RLAST to finalize burst.

Objective: Design an AXI4 Read Master Controller that issues read addresses on AR, accepts streaming beats on R with backpressure control, tracks burst beats until RLAST, and signals completion to the internal core.

Prerequisites: AXI4 Read channel specification (AR and R), burst beat tracking, valid-ready flow control.
PortDirWidthDescription
ACLK, ARESETninput1Clock and active-low synchronous reset
start_readinput1Internal trigger to launch read burst
rd_addr[31:0]input32Requested start address
read_done, read_erroutput1Completion pulse on RLAST; err if RRESP != 0
read_data_out[31:0], read_data_validoutput32, 1Forwarded streaming data beats
ARVALID, ARREADY, ARADDR[31:0]out/in/out1, 1, 32AXI Read Address Channel
RVALID, RREADY, RDATA[31:0], RLAST, RRESP[1:0]in/out/in/in/in1, 1, 32, 1, 2AXI Read Data Channel
Expected Waveform (Golden Timing Contract)
💡 Need Guidance? Progressive Hints (3 Levels)
Hint 1: Conceptual Direction & Hardware Primitives
Launch ARVALID upon start_read. Once ARREADY is sampled high, deassert ARVALID and assert RREADY.
Hint 2: Implementation Architecture & Approach
Each incoming cycle where (RVALID && RREADY) is true represents one valid beat of the read burst.
Hint 3: Edge Cases, Timing & Verilog Syntax
When RLAST is asserted alongside RVALID and RREADY, the final beat of the burst has arrived: deassert RREADY and pulse read_done.
🔒 Reveal Verified Reference RTL Solution (Click to expand)
⚠️ Self-Discovery Warning: Try solving and simulating first! Viewing the verified reference implementation will bypass the real debugging experience.
Verified Synthesizable RTL
module top_module (
  input  wire        ACLK,
  input  wire        ARESETn,
  input  wire        start_read,
  input  wire [31:0] rd_addr,
  output reg         read_done,
  output reg  [31:0] read_data_out,
  output reg         read_data_valid,
  output reg         read_err,
  output reg         ARVALID,
  input  wire        ARREADY,
  output reg  [31:0] ARADDR,
  input  wire        RVALID,
  output reg         RREADY,
  input  wire [31:0] RDATA,
  input  wire        RLAST,
  input  wire [1:0]  RRESP
);

  reg ar_done;

  always @(posedge ACLK or negedge ARESETn) begin
    if (!ARESETn) begin
      read_done       <= 1'b0;
      read_data_out   <= 32'h0;
      read_data_valid <= 1'b0;
      read_err        <= 1'b0;
      ARVALID         <= 1'b0;
      ARADDR          <= 32'h0;
      RREADY          <= 1'b0;
      ar_done         <= 1'b0;
    end else begin
      read_done       <= 1'b0;
      read_data_valid <= 1'b0;

      // Start Read transaction
      if (start_read && !ARVALID && !ar_done) begin
        ARVALID <= 1'b1;
        ARADDR  <= rd_addr;
        ar_done <= 1'b0;
      end

      // AR Channel handshake
      if (ARVALID && ARREADY) begin
        ARVALID <= 1'b0;
        ar_done <= 1'b1;
        RREADY  <= 1'b1; // Ready to receive read beats
      end

      // R Channel beats
      if (RREADY && RVALID) begin
        read_data_out   <= RDATA;
        read_data_valid <= 1'b1;
        if (RRESP != 2'b00) begin
          read_err <= 1'b1;
        end
        if (RLAST) begin
          RREADY    <= 1'b0;
          ar_done   <= 1'b0;
          read_done <= 1'b1;
        end
      end
    end
  end

endmodule
Verilog-2001 / SV Saved
Font: |
// Click Run Tests (or press Ctrl+Enter) to compile your RTL and simulate against hidden testbenches.
Simulation Timing Diagram (VCD Waveform)
100%
No simulation waveform yet. Run tests to simulate and generate VCD traces.
No compilation run yet. Syntax warnings and elaboration messages will appear here.
No simulation output yet. Raw stdout from vvp will appear here.

RTL Problems / Level 6 · Advanced RTL & Protocol Design

What You Will Learn

By solving Burst-Aware AXI4 Read Transaction Controller, you will acquire core industry skills:

  • Synthesizable hardware modeling in standard Verilog-2001 / SystemVerilog.
  • Correct handling of interface port contracts, edge-triggered clocks, and active-low/high resets.
  • Simulation waveform interpretation and debugging using timing diagrams (VCD traces).
  • Architectural avoidance of timing violations, glitching hazards, and synthesis warnings.

Problem Statement & Requirements

Implement an AXI4 read master controller handling address issue, multi-beat read streaming, RLAST tracking, and backpressure.

Hardware design teams at leading semiconductor firms evaluate these exact port contracts, race-condition assertions, and corner cases during technical design reviews and ASIC engineer interviews.

Objective: Design an AXI4 Read Master Controller that issues read addresses on AR, accepts streaming beats on R with backpressure control, tracks burst beats until RLAST, and signals completion to the internal core.

Prerequisites: AXI4 Read channel specification (AR and R), burst beat tracking, valid-ready flow control.

Port List & Interface Timing

The hidden testbench instantiates top_module. Module port names and bit-widths must match the interface contract exactly:

PortDirWidthDescription
ACLK, ARESETninput1Clock and active-low synchronous reset
start_readinput1Internal trigger to launch read burst
rd_addr[31:0]input32Requested start address
read_done, read_erroutput1Completion pulse on RLAST; err if RRESP != 0
read_data_out[31:0], read_data_validoutput32, 1Forwarded streaming data beats
ARVALID, ARREADY, ARADDR[31:0]out/in/out1, 1, 32AXI Read Address Channel
RVALID, RREADY, RDATA[31:0], RLAST, RRESP[1:0]in/out/in/in/in1, 1, 32, 1, 2AXI Read Data Channel

Timing Constraints & Synthesizable RTL Rules

⚡ Synthesizable Implementation Guidelines

Timing Contract: Clocked on posedge ACLK, active-low ARESETn. ARADDR must remain stable while ARVALID=1. RREADY backpressure must be respected without data loss.

Synthesis Constraints: Synthesizable Verilog-2001. Track RLAST to finalize burst.

Architectural Deep Dive & Implementation Walkthrough

AXI4 Read Channel Operation

In AXI4, read transactions use two separate channels:

  • Address Read (AR) Channel: The master sends the starting address (ARADDR) and burst attributes (ARLEN, ARSIZE, ARBURST).
  • Read Data (R) Channel: The slave returns streaming beats along with error status (RRESP). The final beat of the burst is flagged with RLAST = 1.

Unlike write transactions, there is no separate response channel for reads; response status (RRESP) is bundled alongside each individual data beat on the R channel.

Common RTL Designer Pitfalls

⚠️ Common Mistakes to Avoid

Deasserting RREADY before RLAST arrives, causing slave deadlocks or dropped burst beats.

Silicon & Hardware Engineering Notes

🛠️ ASIC vs FPGA Hardware Considerations

AXI read controllers in DDR memory subsystems issue multiple read addresses concurrently (pipelined AR) to saturate memory bank parallelism.

Starter RTL Code

module top_module (
  input  wire        ACLK,
  input  wire        ARESETn,
  input  wire        start_read,
  input  wire [31:0] rd_addr,
  output reg         read_done,
  output reg  [31:0] read_data_out,
  output reg         read_data_valid,
  output reg         read_err,
  output reg         ARVALID,
  input  wire        ARREADY,
  output reg  [31:0] ARADDR,
  input  wire        RVALID,
  output reg         RREADY,
  input  wire [31:0] RDATA,
  input  wire        RLAST,
  input  wire [1:0]  RRESP
);

Verified Reference Solution

🔒 Reveal Verified Reference RTL Solution
module top_module (
  input  wire        ACLK,
  input  wire        ARESETn,
  input  wire        start_read,
  input  wire [31:0] rd_addr,
  output reg         read_done,
  output reg  [31:0] read_data_out,
  output reg         read_data_valid,
  output reg         read_err,
  output reg         ARVALID,
  input  wire        ARREADY,
  output reg  [31:0] ARADDR,
  input  wire        RVALID,
  output reg         RREADY,
  input  wire [31:0] RDATA,
  input  wire        RLAST,
  input  wire [1:0]  RRESP
);

  reg ar_done;

  always @(posedge ACLK or negedge ARESETn) begin
    if (!ARESETn) begin
      read_done       <= 1'b0;
      read_data_out   <= 32'h0;
      read_data_valid <= 1'b0;
      read_err        <= 1'b0;
      ARVALID         <= 1'b0;
      ARADDR          <= 32'h0;
      RREADY          <= 1'b0;
      ar_done         <= 1'b0;
    end else begin
      read_done       <= 1'b0;
      read_data_valid <= 1'b0;

      // Start Read transaction
      if (start_read && !ARVALID && !ar_done) begin
        ARVALID <= 1'b1;
        ARADDR  <= rd_addr;
        ar_done <= 1'b0;
      end

      // AR Channel handshake
      if (ARVALID && ARREADY) begin
        ARVALID <= 1'b0;
        ar_done <= 1'b1;
        RREADY  <= 1'b1; // Ready to receive read beats
      end

      // R Channel beats
      if (RREADY && RVALID) begin
        read_data_out   <= RDATA;
        read_data_valid <= 1'b1;
        if (RRESP != 2'b00) begin
          read_err <= 1'b1;
        end
        if (RLAST) begin
          RREADY    <= 1'b0;
          ar_done   <= 1'b0;
          read_done <= 1'b1;
        end
      end
    end
  end

endmodule

Related RTL Problems in Level 6

  • Manchester Encoder — Combine a data bit with the clock to produce a Manchester-encoded line signal — the self-clocking encoding used in classic Ethernet and RFID.
  • Manchester Decoder — Recover the original data bit from a Manchester-encoded line signal — the exact inverse of the Manchester Encoder problem.
  • Quadrature Rotary Encoder Decoder — Decode the two-phase A/B signal from a real rotary knob or mouse wheel into a direction and position count — sample B on every rising edge of A.

Frequently Asked Questions

What does Burst-Aware AXI4 Read Transaction Controller require?

Implement an AXI4 read master controller handling address issue, multi-beat read streaming, RLAST tracking, and backpressure. Implement it as Verilog module top_module matching the listed ports.

Is this design combinational or sequential?

Tags: advanced-rtl, axi-protocol, systemverilog, asic, fpga. If a clock signal is present in the port table, implement it as sequential logic; otherwise, use continuous assignments or combinational blocks.

How is my solution graded?

A hidden SystemVerilog testbench simulates your module in the cloud judge. You pass when all directed corner cases match the golden model and the VCD timing waveform matches the contract.

How does this challenge help with semiconductor interviews?

Technical interviewers at NVIDIA, Qualcomm, Apple, and Intel routinely ask candidates to code, debug, and explain the timing waveforms of Burst-Aware AXI4 Read Transaction Controller to assess real-world synthesizability and race-condition awareness.